{"text_format":"1","workbook":"xlsx","n_sheets":3,"sheets":["Gantt y Calendarización","Semana","Hoja1"],"not_rendered":{"charts":0,"images":1,"macros":1,"external_links":0,"defined_names":1,"comments":0,"pivot_tables":0},"unopened":[],"bounds":{"document_bytes":16777216,"sheet_cells":100000,"rows_first":2000,"rows_last":500,"rows_between":2000,"halvings":0,"cell_chars":16384,"cell_head_chars":4096},"cells_cut":0,"cells_raw":0,"read":"whole","date_system":"1900"}

{"sheet":"Gantt y Calendarización","index":0,"n_rows":241,"n_cols":324,"rows_kept":241,"cut":false,"hidden":false,"merged":[[1,6,1,11],[2,6,2,11],[4,6,4,11],[1,4,1,5],[1,1,4,3],[3,4,3,5],[6,164,6,167],[6,168,6,172],[6,121,6,124],[6,173,6,176],[6,177,6,180],[6,181,6,184],[6,185,6,189],[6,43,6,46],[6,47,6,50],[6,21,6,24],[6,25,6,28],[59,2,59,5],[60,2,60,5],[61,2,61,5],[2,4,2,5],[4,4,4,5],[53,2,53,5],[54,2,54,5],[55,2,55,5],[56,2,56,5],[57,2,57,5],[46,2,46,5],[58,2,58,5],[47,2,47,5],[48,2,48,5],[49,2,49,5],[50,2,50,5],[51,2,51,5],[52,2,52,5],[40,2,40,5],[41,2,41,5],[42,2,42,5],[43,2,43,5],[44,2,44,5],[45,2,45,5],[37,2,37,5],[30,2,30,5],[31,2,31,5],[32,2,32,5],[33,2,33,5],[14,2,14,5],[15,2,15,5],[17,2,17,5],[16,2,16,5],[27,2,27,5],[8,12,8,63],[6,12,6,16],[6,17,6,20],[6,29,6,33],[6,34,6,37],[6,38,6,42],[12,2,12,5],[13,2,13,5],[26,2,26,5],[18,2,18,5],[19,2,19,5],[5,11,8,11],[6,51,6,55],[6,56,6,59],[6,60,6,63],[5,5,6,5],[241,3,241,5],[10,2,10,5],[11,2,11,5],[5,10,8,10],[24,2,24,5],[25,2,25,5],[71,2,71,5],[72,2,72,5],[73,2,73,5],[39,2,39,5],[28,2,28,5],[29,2,29,5],[81,2,81,5],[82,2,82,5],[83,2,83,5],[84,2,84,5],[85,2,85,5],[86,2,86,5],[87,2,87,5],[88,2,88,5],[89,2,89,5],[90,2,90,5],[91,2,91,5],[92,2,92,5],[242,3,242,5],[243,3,243,5],[7,7,8,7],[5,8,8,8],[7,6,8,6],[70,2,70,5],[244,3,244,5],[245,3,245,5],[34,2,34,5],[35,2,35,5],[36,2,36,5],[38,2,38,5],[66,2,66,5],[67,2,67,5],[68,2,68,5],[69,2,69,5],[6,1,6,2],[74,2,74,5],[75,2,75,5],[76,2,76,5],[77,2,77,5],[78,2,78,5],[79,2,79,5],[80,2,80,5],[246,3,246,5],[247,3,247,5],[248,3,248,5],[249,3,249,5],[250,3,250,5],[251,3,251,5],[252,3,252,5],[253,3,253,5],[254,3,254,5],[255,3,255,5],[256,3,256,5],[257,3,257,5],[258,3,258,5],[259,3,259,5],[260,3,260,5],[261,3,261,5],[262,3,262,5],[263,3,263,5],[264,3,264,5],[265,3,265,5],[266,3,266,5],[267,3,267,5],[268,3,268,5],[269,3,269,5],[270,3,270,5],[271,3,271,5],[272,3,272,5],[273,3,273,5],[274,3,274,5],[275,3,275,5],[276,3,276,5],[277,3,277,5],[278,3,278,5],[279,3,279,5],[280,3,280,5],[281,3,281,5],[282,3,282,5],[283,3,283,5],[284,3,284,5],[285,3,285,5],[286,3,286,5],[287,3,287,5],[288,3,288,5],[289,3,289,5],[290,3,290,5],[291,3,291,5],[292,3,292,5],[293,3,293,5],[294,3,294,5],[295,3,295,5],[296,3,296,5],[297,3,297,5],[298,3,298,5],[299,3,299,5],[300,3,300,5],[301,3,301,5],[302,3,302,5],[303,3,303,5],[304,3,304,5],[305,3,305,5],[306,3,306,5],[307,3,307,5],[308,3,308,5],[309,3,309,5],[310,3,310,5],[311,3,311,5],[312,3,312,5],[313,3,313,5],[314,3,314,5],[315,3,315,5],[316,3,316,5],[317,3,317,5],[318,3,318,5],[319,3,319,5],[320,3,320,5],[321,3,321,5],[322,3,322,5],[323,3,323,5],[324,3,324,5],[325,3,325,5],[326,3,326,5],[327,3,327,5],[328,3,328,5],[329,3,329,5],[330,3,330,5],[331,3,331,5],[332,3,332,5],[333,3,333,5],[334,3,334,5],[335,3,335,5],[336,3,336,5],[337,3,337,5],[338,3,338,5],[339,3,339,5],[340,3,340,5],[341,3,341,5],[342,3,342,5],[343,3,343,5],[344,3,344,5],[345,3,345,5],[346,3,346,5],[347,3,347,5],[348,3,348,5],[349,3,349,5],[350,3,350,5],[351,3,351,5],[352,3,352,5],[353,3,353,5],[354,3,354,5],[355,3,355,5],[356,3,356,5],[357,3,357,5],[358,3,358,5],[359,3,359,5],[360,3,360,5],[361,3,361,5],[362,3,362,5],[363,3,363,5],[364,3,364,5],[365,3,365,5],[366,3,366,5],[367,3,367,5],[368,3,368,5],[369,3,369,5],[370,3,370,5],[371,3,371,5],[372,3,372,5],[373,3,373,5],[374,3,374,5],[375,3,375,5],[376,3,376,5],[377,3,377,5],[378,3,378,5],[379,3,379,5],[391,3,391,5],[380,3,380,5],[381,3,381,5],[382,3,382,5],[383,3,383,5],[384,3,384,5],[385,3,385,5],[394,3,394,5],[395,3,395,5],[396,3,396,5],[397,3,397,5],[386,3,386,5],[387,3,387,5],[388,3,388,5],[389,3,389,5],[390,3,390,5],[407,3,407,5],[5,9,8,9],[20,2,20,5],[21,2,21,5],[22,2,22,5],[23,2,23,5],[398,3,398,5],[399,3,399,5],[400,3,400,5],[393,3,393,5],[404,3,404,5],[405,3,405,5],[406,3,406,5],[401,3,401,5],[402,3,402,5],[403,3,403,5],[392,3,392,5],[5,1,5,2],[7,1,8,1],[7,2,8,5],[62,2,62,5],[63,2,63,5],[64,2,64,5],[65,2,65,5],[93,2,93,5],[94,2,94,5],[95,2,95,5],[96,2,96,5],[97,2,97,5],[98,2,98,5],[99,2,99,5],[100,2,100,5],[101,2,101,5],[102,2,102,5],[103,2,103,5],[104,2,104,5],[105,2,105,5],[106,2,106,5],[107,2,107,5],[108,2,108,5],[109,2,109,5],[110,2,110,5],[111,2,111,5],[112,2,112,5],[113,2,113,5],[114,2,114,5],[115,2,115,5],[116,2,116,5],[117,2,117,5],[118,2,118,5],[119,2,119,5],[120,2,120,5],[121,2,121,5],[122,2,122,5],[123,2,123,5],[124,2,124,5],[125,2,125,5],[126,2,126,5],[127,2,127,5],[128,2,128,5],[129,2,129,5],[130,2,130,5],[131,2,131,5],[132,2,132,5],[133,2,133,5],[134,2,134,5],[135,2,135,5],[136,2,136,5],[137,2,137,5],[138,2,138,5],[139,2,139,5],[140,2,140,5],[141,2,141,5],[142,2,142,5],[143,2,143,5],[144,2,144,5],[145,2,145,5],[146,2,146,5],[147,2,147,5],[148,2,148,5],[149,2,149,5],[150,2,150,5],[151,2,151,5],[152,2,152,5],[153,2,153,5],[154,2,154,5],[155,2,155,5],[156,2,156,5],[157,2,157,5],[158,2,158,5],[159,2,159,5],[160,2,160,5],[161,2,161,5],[162,2,162,5],[163,2,163,5],[164,2,164,5],[165,2,165,5],[166,2,166,5],[167,2,167,5],[168,2,168,5],[169,2,169,5],[170,2,170,5],[171,2,171,5],[172,2,172,5],[173,2,173,5],[174,2,174,5],[175,2,175,5],[176,2,176,5],[177,2,177,5],[178,2,178,5],[179,2,179,5],[180,2,180,5],[181,2,181,5],[182,2,182,5],[183,2,183,5],[184,2,184,5],[185,2,185,5],[186,2,186,5],[187,2,187,5],[188,2,188,5],[189,2,189,5],[190,2,190,5],[191,2,191,5],[192,2,192,5],[193,2,193,5],[194,2,194,5],[195,2,195,5],[196,2,196,5],[197,2,197,5],[198,2,198,5],[199,2,199,5],[200,2,200,5],[216,2,216,5],[217,2,217,5],[218,2,218,5],[219,2,219,5],[220,2,220,5],[221,2,221,5],[222,2,222,5],[223,2,223,5],[201,2,201,5],[202,2,202,5],[203,2,203,5],[204,2,204,5],[205,2,205,5],[206,2,206,5],[207,2,207,5],[208,2,208,5],[209,2,209,5],[240,2,240,5],[9,2,9,5],[230,2,230,5],[231,2,231,5],[232,2,232,5],[233,2,233,5],[234,2,234,5],[235,2,235,5],[224,2,224,5],[225,2,225,5],[236,2,236,5],[237,2,237,5],[238,2,238,5],[239,2,239,5],[226,2,226,5],[227,2,227,5],[228,2,228,5],[229,2,229,5],[210,2,210,5],[211,2,211,5],[212,2,212,5],[213,2,213,5],[214,2,214,5],[215,2,215,5],[8,64,8,115],[6,116,6,120],[6,125,6,128],[6,129,6,132],[6,133,6,137],[6,138,6,141],[6,142,6,146],[6,147,6,150],[6,151,6,154],[8,116,8,167],[6,64,6,68],[6,69,6,72],[6,73,6,76],[6,77,6,80],[6,81,6,85],[6,86,6,89],[6,90,6,94],[6,95,6,98],[6,99,6,102],[6,103,6,107],[6,108,6,111],[6,112,6,115],[6,155,6,159],[6,160,6,163],[6,194,6,198],[6,199,6,202],[6,203,6,206],[6,207,6,211],[6,212,6,215],[6,216,6,219],[8,168,8,219],[6,220,6,224],[8,220,8,271],[6,255,6,258],[6,268,6,271],[6,311,6,315],[6,316,6,319],[6,320,6,323],[8,272,8,323],[3,6,3,11],[6,272,6,276],[6,277,6,280],[6,281,6,284],[6,285,6,288],[6,289,6,293],[6,294,6,297],[6,298,6,302],[6,303,6,306],[6,307,6,310],[6,225,6,228],[6,229,6,232],[6,233,6,236],[6,237,6,241],[6,242,6,245],[6,246,6,250],[6,251,6,254],[6,259,6,263],[6,264,6,267],[6,190,6,193]]}
[]
[null,"CALENDARIZACIÓN DE ACTIVIDADES",null,null,"DEPENDENCIA:"]
[null,null,null,null,"NOMBRE DE PROYECTO:"]
[null,null,null,null,"NOMBRE DE RESPONSABLE:"]
[null,null,null,null,"PERIODO:"]
[null,"Tamaño Periodo",null,{"$f":"((H7-H6)/365)","v":0},"años",null,"Inicio",{"$f":"MIN($G$10,$H$9887)","v":"00:00:00"},"Duración","Semana Inicio","Semana Final","Estado",2013,2013,2013,2013,2013,2013,2013,2013,2013,2013,2013,2013,2013,2013,2013,2013,2013,2013,2013,2013,2013,2013,2013,2013,2013,2013,2013,2013,2013,2013,2013,2013,2013,2013,2013,2013,2013,2013,2013,2013,2013,2013,2013,2013,2013,2013,2013,2013,2013,2013,2013,2013,2014,2014,2014,2014,2014,2014,2014,2014,2014,2014,2014,2014,2014,2014,2014,2014,2014,2014,2014,2014,2014,2014,2014,2014,2014,2014,2014,2014,2014,2014,2014,2014,2014,2014,2014,2014,2014,2014,2014,2014,2014,2014,2014,2014,2014,2014,2014,2014,2014,2014,2014,2014,2015,2015,2015,2015,2015,2015,2015,2015,2015,2015,2015,2015,2015,2015,2015,2015,2015,2015,2015,2015,2015,2015,2015,2015,2015,2015,2015,2015,2015,2015,2015,2015,2015,2015,2015,2015,2015,2015,2015,2015,2015,2015,2015,2015,2015,2015,2015,2015,2015,2015,2015,2015,2016,2016,2016,2016,2016,2016,2016,2016,2016,2016,2016,2016,2016,2016,2016,2016,2016,2016,2016,2016,2016,2016,2016,2016,2016,2016,2016,2016,2016,2016,2016,2016,2016,2016,2016,2016,2016,2016,2016,2016,2016,2016,2016,2016,2016,2016,2016,2016,2016,2016,2016,2016,2017,2017,2017,2017,2017,2017,2017,2017,2017,2017,2017,2017,2017,2017,2017,2017,2017,2017,2017,2017,2017,2017,2017,2017,2017,2017,2017,2017,2017,2017,2017,2017,2017,2017,2017,2017,2017,2017,2017,2017,2017,2017,2017,2017,2017,2017,2017,2017,2017,2017,2017,2017,2018,2018,2018,2018,2018,2018,2018,2018,2018,2018,2018,2018,2018,2018,2018,2018,2018,2018,2018,2018,2018,2018,2018,2018,2018,2018,2018,2018,2018,2018,2018,2018,2018,2018,2018,2018,2018,2018,2018,2018,2018,2018,2018,2018,2018,2018,2018,2018,2018,2018,2018,2018]
[null,"Fecha Inicio",null,{"$f":"G10","v":"00:00:00"},null,null,"Fin",{"$f":"MAX($G$10:$H$9887)","v":"00:00:00"},null,null,null,null,"Enero",null,null,null,null,"Febrero",null,null,null,"Marzo",null,null,null,"Abril",null,null,null,"Mayo",null,null,null,null,"Junio",null,null,null,"Julio",null,null,null,null,"Agosto",null,null,null,"Septiembre",null,null,null,"Octubre",null,null,null,null,"Noviembre",null,null,null,"Diciembre",null,null,null,"Enero",null,null,null,null,"Febrero",null,null,null,"Marzo",null,null,null,"Abril",null,null,null,"Mayo",null,null,null,null,"Junio",null,null,null,"Julio",null,null,null,null,"Agosto",null,null,null,"Septiembre",null,null,null,"Octubre",null,null,null,null,"Noviembre",null,null,null,"Diciembre",null,null,null,"Enero",null,null,null,null,"Febrero",null,null,null,"Marzo",null,null,null,"Abril",null,null,null,"Mayo",null,null,null,null,"Junio",null,null,null,"Julio",null,null,null,null,"Agosto",null,null,null,"Septiembre",null,null,null,"Octubre",null,null,null,null,"Noviembre",null,null,null,"Diciembre",null,null,null,"Enero",null,null,null,null,"Febrero",null,null,null,"Marzo",null,null,null,"Abril",null,null,null,"Mayo",null,null,null,null,"Junio",null,null,null,"Julio",null,null,null,null,"Agosto",null,null,null,"Septiembre",null,null,null,"Octubre",null,null,null,null,"Noviembre",null,null,null,"Diciembre",null,null,null,"Enero",null,null,null,null,"Febrero",null,null,null,"Marzo",null,null,null,"Abril",null,null,null,"Mayo",null,null,null,null,"Junio",null,null,null,"Julio",null,null,null,null,"Agosto",null,null,null,"Septiembre",null,null,null,"Octubre",null,null,null,null,"Noviembre",null,null,null,"Diciembre",null,null,null,"Enero",null,null,null,null,"Febrero",null,null,null,"Marzo",null,null,null,"Abril",null,null,null,"Mayo",null,null,null,null,"Junio",null,null,null,"Julio",null,null,null,null,"Agosto",null,null,null,"Septiembre",null,null,null,"Octubre",null,null,null,null,"Noviembre",null,null,null,"Diciembre"]
[null,"Ítem","Descripción de Actividades",null,null,null,"Fecha de Inicio","Fecha Final",null,null,null,null,1,2,3,4,5,6,7,8,9,10,11,12,13,14,15,16,17,18,19,20,21,22,23,24,25,26,27,28,29,30,31,32,33,34,35,36,37,38,39,40,41,42,43,44,45,46,47,48,49,50,51,52,53,54,55,56,57,58,59,60,61,62,63,64,65,66,67,68,69,70,71,72,73,74,75,76,77,78,79,80,81,82,83,84,85,86,87,88,89,90,91,92,93,94,95,96,97,98,99,100,101,102,103,104,105,106,107,108,109,110,111,112,113,114,115,116,117,118,119,120,121,122,123,124,125,126,127,128,129,130,131,132,133,134,135,136,137,138,139,140,141,142,143,144,145,146,147,148,149,150,151,152,153,154,155,156,157,158,159,160,161,162,163,164,165,166,167,168,169,170,171,172,173,174,175,176,177,178,179,180,181,182,183,184,185,186,187,188,189,190,191,192,193,194,195,196,197,198,199,200,201,202,203,204,205,206,207,208,209,210,211,212,213,214,215,216,217,218,219,220,221,222,223,224,225,226,227,228,229,230,231,232,233,234,235,236,237,238,239,240,241,242,243,244,245,246,247,248,249,250,251,252,253,254,255,256,257,258,259,260,261,262,263,264,265,266,267,268,269,270,271,272,273,274,275,276,277,278,279,280,281,282,283,284,285,286,287,288,289,290,291,292,293,294,295,296,297,298,299,300,301,302,303,304,305,306,307,308,309,310,311,312]
[]
[null,{"$f":"IF(ISERROR(IF(C10<>\"\",#REF!+1,\"-\")),1,IF(C10<>\"\",#REF!+1,\"-\"))","v":"-"},null,null,null,null,null,{"$f":"IF(G10<>\"\",IF(I10<>\"\",G10+I10,\"-\"),\"-\")","v":"-"},null,{"$f":"IF(ISERROR(VLOOKUP(G10,Semana!A:B,2,FALSE)),\"-\",VLOOKUP(G10,Semana!A:B,2,FALSE))","v":"-"},{"$f":"IF(ISERROR(VLOOKUP(H10,Semana!A:B,2,FALSE)),\"-\",VLOOKUP(H10,Semana!A:B,2,FALSE))","v":"-"},null,{"$f":"+IF(AND(M$8>=$J10,M$8<=$K10),$L10,\" \")","v":" "}," "," "," "," "," "," "," "," "," "," "," "," "," "," "," "," "," "," "," "," "," "," "," "," "," "," "," "," "," "," "," "," "," "," "," "," "," "," "," "," "," "," "," "," "," "," "," "," "," "," "," "," "," "," "," "," "," "," "," "," "," "," "," ",{"$f":"+IF(AND(BY$8>=$J10,BY$8<=$K10),$L10,\" \")","v":" "}," "," "," "," "," "," "," "," "," "," "," "," "," "," "," "," "," "," "," "," "," "," "," "," "," "," "," "," "," "," "," "," "," "," "," "," "," "," "," "," "," "," "," "," "," "," "," "," "," "," "," "," "," "," "," "," "," "," "," "," "," "," "," ",{"$f":"+IF(AND(EK$8>=$J10,EK$8<=$K10),$L10,\" \")","v":" "}," "," "," "," "," "," "," "," "," "," "," "," "," "," "," "," "," "," "," "," "," "," "," "," "," "," "," "," "," "," "," "," "," "," "," "," "," "," "," "," "," "," "," "," "," "," "," "," "," "," "," "," "," "," "," "," "," "," "," "," "," "," "," ",{"$f":"+IF(AND(GW$8>=$J10,GW$8<=$K10),$L10,\" \")","v":" "}," "," "," "," "," "," "," "," "," "," "," "," "," "," "," "," "," "," "," "," "," "," "," "," "," "," "," "," "," "," "," "," "," "," "," "," "," "," "," "," "," "," "," "," "," "," "," "," "," "," "," "," "," "," "," "," "," "," "," "," "," "," "," ",{"$f":"+IF(AND(JI$8>=$J10,JI$8<=$K10),$L10,\" \")","v":" "}," "," "," "," "," "," "," "," "," "," "," "," "," "," "," "," "," "," "," "," "," "," "," "," "," "," "," "," "," "," "," "," "," "," "," "," "," "," "," "," "," "," "," "," "," "," "," "," "," "," "," "," "," "," "," "]
[null,{"$f":"IF(ISERROR(IF(C11<>\"\",B10+1,\"-\")),1,IF(C11<>\"\",B10+1,\"-\"))","v":"-"},null,null,null,null,null,{"$f":"IF(G11<>\"\",IF(I11<>\"\",G11+I11,\"-\"),\"-\")","v":"-"},null,{"$f":"IF(ISERROR(VLOOKUP(G11,Semana!A:B,2,FALSE)),\"-\",VLOOKUP(G11,Semana!A:B,2,FALSE))","v":"-"},{"$f":"IF(ISERROR(VLOOKUP(H11,Semana!A:B,2,FALSE)),\"-\",VLOOKUP(H11,Semana!A:B,2,FALSE))","v":"-"},null," "," "," "," "," "," "," "," "," "," "," "," "," "," "," "," "," "," "," "," "," "," "," "," "," "," "," "," "," "," "," "," "," "," "," "," "," "," "," "," "," "," "," "," "," "," "," "," "," "," "," "," "," "," "," "," "," "," "," "," "," "," "," "," "," "," "," "," "," "," "," "," "," "," "," "," "," "," "," "," "," "," "," "," "," "," "," "," "," "," "," "," "," "," "," "," "," "," "," "," "," "," "," "," "," "," "," "," "," "," "," "," "," "," "," "," "," "," "," "," "," "," "," "," "," "," "," "," "," "," "," "," "," "," "," "," "," "," "," "," "," "," "," "," "," "," "," "," "," "," "," "," "," "," "," "," "," "," "," "," "," "," "," "," "," "," "," "," "," "," "," "," "," "," "," "," "," "," "," "," "," "," "," "," "," "," "," "," "," "," "," "," "," "," "," "," "," "," "," "," "," "," "," "," "," "," "," "," "," "," "," "," "," "," "," "," "," "," "," "," "," "," "," "," "," "," "," "," "," "," "," "," "," "," "," "," "," "," "," "," "," "," "," "," "," "," "," "," "," "," "," "," "," "," "," "," "," "," "," "," "," "," "," "," "," "," "," "," "," "," "," "," "," "," "," "," "," "," "," "," "," "," "," "," "," "," "," "," "," "," "," "," "," "," "," "," "," "," "," "," "," "," "," "," "," "," "," "," "," "," "," "," "]
[null,"-",null,null,null,null,null,"-",null,{"$f":"IF(ISERROR(VLOOKUP(G12,Semana!A:B,2,FALSE)),\"-\",VLOOKUP(G12,Semana!A:B,2,FALSE))","v":"-"},{"$f":"IF(ISERROR(VLOOKUP(H12,Semana!A:B,2,FALSE)),\"-\",VLOOKUP(H12,Semana!A:B,2,FALSE))","v":"-"},null," "," "," "," "," "," "," "," "," "," "," "," "," "," "," "," "," "," "," "," "," "," "," "," "," "," "," "," "," "," "," "," "," "," "," "," "," "," "," "," "," "," "," "," "," "," "," "," "," "," "," "," "," "," "," "," "," "," "," "," "," "," "," "," "," "," "," "," "," "," "," "," "," "," "," "," "," "," "," "," "," "," "," "," "," "," "," "," "," "," "," "," "," "," "," "," "," "," "," "," "," "," "," "," "," "," "," "," "," "," "," "," "," "," "," "," "," "," "," "," "," "," "," "," "," "," "," "," "," "," "," "," "," "," "," "," "," "," "," "," "," "," "," "," "," "," "," "," "," "," "," "," "," "," "," "," "," "," "," "," "," "," "," "," "," "," "," "," "," "," "," "," "," "," "," "," "," "," "," "," "," "," "," "," "," "," "," "," "," "," "," "," "," "," "," "," "," "," "," "," "," "," "," "," "," "," "," "," "," "," "," "," "," "," "," "," "," "," "," "," "," "," "," "," "," "," "," "," "," "," "," "," "," "," "," "," "," "," "," "," "," "," "," "," "," "," "," "," "," "," "," "," "," "," "," "," "," "," "," "," "," "," "," "," "," "," "," "," "," "," "," "," "," "," "," "," "," "," "," "," "," "," "," "," "," "," "," "," "," "," "," "," "," "," "," "," "," "," "," "," "," "," "," "," "," "," "," "," "," "," "," "," "]
[null,"-",null,null,null,null,null,"-",null,{"$f":"IF(ISERROR(VLOOKUP(G13,Semana!A:B,2,FALSE)),\"-\",VLOOKUP(G13,Semana!A:B,2,FALSE))","v":"-"},{"$f":"IF(ISERROR(VLOOKUP(H13,Semana!A:B,2,FALSE)),\"-\",VLOOKUP(H13,Semana!A:B,2,FALSE))","v":"-"},null," "," "," "," "," "," "," "," "," "," "," "," "," "," "," "," "," "," "," "," "," "," "," "," "," "," "," "," "," "," "," "," "," "," "," "," "," "," "," "," "," "," "," "," "," "," "," "," "," "," "," "," "," "," "," "," "," "," "," "," "," "," "," ",{"$f":"+IF(AND(BX$8>=$J13,BX$8<=$K13),$L13,\" \")","v":" "}," "," "," "," "," "," "," "," "," "," "," "," "," "," "," "," "," "," "," "," "," "," "," "," "," "," "," "," "," "," "," "," "," "," "," "," "," "," "," "," "," "," "," "," "," "," "," "," "," "," "," "," "," "," "," "," "," "," "," "," "," "," "," ",{"$f":"+IF(AND(EJ$8>=$J13,EJ$8<=$K13),$L13,\" \")","v":" "}," "," "," "," "," "," "," "," "," "," "," "," "," "," "," "," "," "," "," "," "," "," "," "," "," "," "," "," "," "," "," "," "," "," "," "," "," "," "," "," "," "," "," "," "," "," "," "," "," "," "," "," "," "," "," "," "," "," "," "," "," "," "," ",{"$f":"+IF(AND(GV$8>=$J13,GV$8<=$K13),$L13,\" \")","v":" "}," "," "," "," "," "," "," "," "," "," "," "," "," "," "," "," "," "," "," "," "," "," "," "," "," "," "," "," "," "," "," "," "," "," "," "," "," "," "," "," "," "," "," "," "," "," "," "," "," "," "," "," "," "," "," "," "," "," "," "," "," "," "," ",{"$f":"+IF(AND(JH$8>=$J13,JH$8<=$K13),$L13,\" \")","v":" "}," "," "," "," "," "," "," "," "," "," "," "," "," "," "," "," "," "," "," "," "," "," "," "," "," "," "," "," "," "," "," "," "," "," "," "," "," "," "," "," "," "," "," "," "," "," "," "," "," "," "," "," "," "," "," "," "]
[null,"-",null,null,null,null,null,"-",null,{"$f":"IF(ISERROR(VLOOKUP(G14,Semana!A:B,2,FALSE)),\"-\",VLOOKUP(G14,Semana!A:B,2,FALSE))","v":"-"},{"$f":"IF(ISERROR(VLOOKUP(H14,Semana!A:B,2,FALSE)),\"-\",VLOOKUP(H14,Semana!A:B,2,FALSE))","v":"-"},null," "," "," "," "," "," "," "," "," "," "," "," "," "," "," "," "," "," "," "," "," "," "," "," "," "," "," "," "," "," "," "," "," "," "," "," "," "," "," "," "," "," "," "," "," "," "," "," "," "," "," "," "," "," "," "," "," "," "," "," "," "," "," "," "," "," "," "," "," "," "," "," "," "," "," "," "," "," "," "," "," "," "," "," "," "," "," "," "," "," "," "," "," "," "," "," "," "," "," "," "," "," "," "," "," "," "," "," "," "," "," "," "," "," "," "," "," "," "," "," "," "," "," "," "," "," "," "," "," "," "," "," "," "," "," "," "," "," "," "," "," "," "," "," "," "," "," "," "," "," "," "," "," "," "," "," "," "," "," "," "," "," "," "," "," "," "," "," "," "," "," "," "," "," "," "," "," "," "," "," "," "," "," "," "," "," "," "," "," "," "," "," "," "," "," "," "," "," "," "," "," "," "," "," "," "," "," "," "," "," "," "," "," "," "," "," "," "," "," "," "," "," "," "," "," "," "," "," "," "," "," "," "," "," "," "," "," "," "," "," "," "," "," "," "," "," "," "," "," "," "," "," "," "," "," "," "," "," "," "," "," "," "," "," "," "," "," "," "," "," "," "," "," "," "," "," "," "," "," "," "," "," "," "," "," "," "," ",{"$f":"+IF(AND(KN$8>=$J14,KN$8<=$K14),$L14,\" \")","v":" "}," "," "," "," "," "," "," "," "," "," "," "," "," "," "," ",{"$f":"+IF(AND(LD$8>=$J14,LD$8<=$K14),$L14,\" \")","v":" "}," "," "," "," "," "," "," "," "]
[null,"-",null,null,null,null,null,"-",null,{"$f":"IF(ISERROR(VLOOKUP(G15,Semana!A:B,2,FALSE)),\"-\",VLOOKUP(G15,Semana!A:B,2,FALSE))","v":"-"},{"$f":"IF(ISERROR(VLOOKUP(H15,Semana!A:B,2,FALSE)),\"-\",VLOOKUP(H15,Semana!A:B,2,FALSE))","v":"-"},null," "," "," "," "," "," "," "," "," "," "," "," "," "," "," "," "," "," "," "," "," "," "," "," "," "," "," "," "," "," "," "," "," "," "," "," "," "," "," "," "," "," "," "," "," "," "," "," "," "," "," "," "," "," "," "," "," "," "," "," "," "," "," "," "," "," "," "," "," "," "," "," "," "," "," "," "," "," "," "," "," "," "," "," "," "," "," "," "," "," "," "," "," "," "," "," "," "," "," "," "," "," "," "," "," "," "," "," "," "," "," "," "," "," "," "," "," "," "," "," "," "," "," "," "," "," "," "," "," "," "," "," "," "," "," "," "," "," "," "," "," "," "," "," "," "," "," "," "," "," "," "," "," "," "," "," "," "," "," "," "," "," "," "," "," "," "," "," "," "," "," "," "," "," "," "," "," "," "," "," "," "," "," "," "," "," "," "," "," "," "," "," "," "," "," "," "," "," "," "," "," "," "," "," "," "," "," "," "," "," "," "," "," "," "," "," "," "," "," "," "," "," "," "," "," "," "," "," "," "," "," "," "," "," "," "," "," "," "," "," "," "," "," "," "," "," "," "," "," "," "," "," "," "," "," "," ",{"$f":"+IF(AND(JI$8>=$J15,JI$8<=$K15),$L15,\" \")","v":" "}," "," "," "," "," "," "," "," "," "," "," "," "," "," "," ",{"$f":"+IF(AND(JY$8>=$J15,JY$8<=$K15),$L15,\" \")","v":" "}," "," "," "," "," "," "," "," "," "," "," "," "," "," "," "," "," "," "," "," "," "," "," "," "," "," "," "," "," "," "," "," "," "," "," "," "," "," "," "]
{"$rows_left_out":227}
{"sheet":"Semana","index":1,"n_rows":2194,"n_cols":2,"rows_kept":2194,"cut":false,"hidden":true,"merged":[[1,0,1,1]]}
[]
["ASIGNACIÓN SEMANA"]
["DIA","SEMANA"]
["2013-01-01",1]
["2013-01-02",1]
["2013-01-03",1]
["2013-01-04",1]
["2013-01-05",1]
["2013-01-06",2]
["2013-01-07",2]
["2013-01-08",2]
["2013-01-09",2]
["2013-01-10",2]
["2013-01-11",2]
["2013-01-12",2]
{"$rows_left_out":2180}
{"sheet":"Hoja1","index":2,"n_rows":0,"n_cols":0,"rows_kept":0,"cut":false,"hidden":true,"merged":[]}